{"text_format":"1","workbook":"xlsx","n_sheets":6,"sheets":["Instructions","Calculator","Scale of Entitlements (RTW Act)","Version Control","Check Errors","WPI All Years"],"not_rendered":{"charts":1,"images":0,"macros":1,"external_links":0,"defined_names":3,"comments":2,"pivot_tables":0},"unopened":[],"bounds":{"document_bytes":16777216,"sheet_cells":100000,"rows_first":2000,"rows_last":500,"rows_between":2000,"halvings":0,"cell_chars":16384,"cell_head_chars":4096},"cells_cut":0,"cells_raw":0,"read":"whole","date_system":"1900"}

{"sheet":"Instructions","index":0,"n_rows":34,"n_cols":2,"rows_kept":34,"cut":false,"hidden":false,"merged":[]}
[null,"S58 Lump Sum Calculator \n(for whole person impairment)"]
[]
["INSTRUCTIONS ","(NOTE this spreadsheet must be saved locally and opened in excel)"]
[]
["The calculator is to be used to calculate lump sum compensation payable for a permanent impairment "]
["assessment in accordance with section 22 of the Return To Work Act 2014."]
[]
["Before using the calculator it is necessary to reach a determination that you will accept the claim for  "]
["compensation under section 58 of the Return To Work Act 2014 and have the details "]
["of any previous lump sums paid."]
[]
["Where an assessment report includes multiple injuries which have been assessed in chronological order "]
["according to date of injury then the case manager is to enter each injury in separate columns titled "]
["injury one to injury six."]
[]
["CAUTION "]
[]
["The calculator requires values to be entered to the 'Date of Injury' and 'Final %WPI from the assessment report'   "]
["fields to provide a calculation of amount compensable."]
[]
["1. Enter the Worker's Name"]
[]
["2. Enter the following details in the top section - Claim ID"]
["- Claim Number"]
["- Date of Injury","The year of injury determines the prescribed sum to be used in the calculation."]
["- Case Manager's Name"]
[]
["3. Enter the following details in the section - Assessment"]
["- Final % WPI rating ","Where multiple injuries for the same worker have been assessed \nseparately then the details must be entered separately to the calculator \n(ie, repeat for each assessment and enter the %WPI into this field).  \nWhere the injuries have been assessed together then the final \n%WPI can be entered to this field.\n"]
["- Previous lump sum amounts paid","Enter amounts of all previous lump sum payments paid (including payments for disfigurement and previous lump sums).  There are up to 5 fields available to collect this information."]
[]
["4. Calculation","The amounts in this section will display automatically once you have entered values in the two sections above."]
[]
["- Total amount of compensation payable","This amount is the sum of compensation payable for all injuries."]

{"sheet":"Calculator","index":1,"n_rows":40,"n_cols":17,"rows_kept":40,"cut":false,"hidden":false,"merged":[[2,3,2,7]]}
[null,"S58 Lump sum calculator for whole person impairment\n",null,null,null,null,null,null,null,null,null,null,null,null,null," "]
[]
[{"$f":"\"Version: \"&MAX('Version Control'!B:B)","v":"Version: 19.1"},"Worker's Name:"]
[]
[{"$f":"MAX('Version Control'!C:C)","v":"2018-01-02"},null,null,"Injury Details",null,"Injury Details",null,"Injury Details",null,"Injury Details",null,"Injury Details",null,"Injury Details"]
[]
["Claim ID","Claim Number:"]
[null,"Date of Injury (dd/mm/yyyy):"]
[null,"Case Manager's Name:",null,null,null,null,null,null,null,null,null,null,null,null,null,null," "]
[]
["Assessment","Final % WPI from the assessment report"]
[null,"Previous lump sum payments paid S58(7)  1"]
[null,2]
[null,3]
[null,4]
[null,5]
[null,null,null,{"$f":"IF(D18<2008,2008,D18)","v":""},null,{"$f":"IF(F18<2008,2008,F18)","v":""},null,{"$f":"IF(H18<2008,2008,H18)","v":""},null,{"$f":"IF(J18<2008,2008,J18)","v":""},null,{"$f":"IF(L18<2008,2008,L18)","v":""},null,{"$f":"IF(N18<2008,2008,N18)","v":""}]
["Calculation","Year of injury (yyyy):",null,{"$f":"IF(ISNUMBER(D$8),IF(OR(D$8>TODAY(),YEAR(D$8)<1987),\"Invalid date of Injury\",YEAR(D8)),\"\")","v":""},null,{"$f":"IF(ISNUMBER(F$8),IF(OR(F$8>TODAY(),YEAR(F$8)<1987),\"Invalid date of Injury\",YEAR(F8)),\"\")","v":""},null,{"$f":"IF(ISNUMBER(H$8),IF(OR(H$8>TODAY(),YEAR(H$8)<1987),\"Invalid date of Injury\",YEAR(H8)),\"\")","v":""},null,{"$f":"IF(ISNUMBER(J$8),IF(OR(J$8>TODAY(),YEAR(J$8)<1987),\"Invalid date of Injury\",YEAR(J8)),\"\")","v":""},null,{"$f":"IF(ISNUMBER(L$8),IF(OR(L$8>TODAY(),YEAR(L$8)<1987),\"Invalid date of Injury\",YEAR(L8)),\"\")","v":""},null,{"$f":"IF(ISNUMBER(N$8),IF(OR(N$8>TODAY(),YEAR(N$8)<1987),\"Invalid date of Injury\",YEAR(N8)),\"\")","v":""}]
[null,"WPI compensation:",null,{"$f":"IF(AND(ISNUMBER(D$8),ISNUMBER(D$11)),IF(AND(D$8>=42005,D$8<=42185),VLOOKUP(D$11,'WPI All Years'!$A$2:$I$102,9,FALSE),IF(AND(D$8>=42186,D$8<=42369),VLOOKUP(D$11,'WPI All Years'!$A$2:$J$102,10,FALSE),INDEX('WPI All Years'!$A$2:$O$102,MATCH(D11,'WPI All Years'!$A$2:$A$102,0),MATCH(D$17,'WPI All Years'!$A$1:$O$1,0)))),\"\")","v":""},null,{"$f":"IF(AND(ISNUMBER(F$8),ISNUMBER(F$11)),IF(AND(F$8>=42005,F$8<=42185),VLOOKUP(F$11,'WPI All Years'!$A$2:$I$102,9,FALSE),IF(AND(F$8>=42186,F$8<=42369),VLOOKUP(F$11,'WPI All Years'!$A$2:$J$102,10,FALSE),INDEX('WPI All Years'!$A$2:$O$102,MATCH(F11,'WPI All Years'!$A$2:$A$102,0),MATCH(F$17,'WPI All Years'!$A$1:$O$1,0)))),\"\")","v":""},null,{"$f":"IF(AND(ISNUMBER(H$8),ISNUMBER(H$11)),IF(AND(H$8>=42005,H$8<=42185),VLOOKUP(H$11,'WPI All Years'!$A$2:$I$102,9,FALSE),IF(AND(H$8>=42186,H$8<=42369),VLOOKUP(H$11,'WPI All Years'!$A$2:$J$102,10,FALSE),INDEX('WPI All Years'!$A$2:$O$102,MATCH(H11,'WPI All Years'!$A$2:$A$102,0),MATCH(H$17,'WPI All Years'!$A$1:$O$1,0)))),\"\")","v":""},null,{"$f":"IF(AND(ISNUMBER(J$8),ISNUMBER(J$11)),IF(AND(J$8>=42005,J$8<=42185),VLOOKUP(J$11,'WPI All Years'!$A$2:$I$102,9,FALSE),IF(AND(J$8>=42186,J$8<=42369),VLOOKUP(J$11,'WPI All Years'!$A$2:$J$102,10,FALSE),INDEX('WPI All Years'!$A$2:$O$102,MATCH(J11,'WPI All Years'!$A$2:$A$102,0),MATCH(J$17,'WPI All Years'!$A$1:$O$1,0)))),\"\")","v":""},null,{"$f":"IF(AND(ISNUMBER(L$8),ISNUMBER(L$11)),IF(AND(L$8>=42005,L$8<=42185),VLOOKUP(L$11,'WPI All Years'!$A$2:$I$102,9,FALSE),IF(AND(L$8>=42186,L$8<=42369),VLOOKUP(L$11,'WPI All Years'!$A$2:$J$102,10,FALSE),INDEX('WPI All Years'!$A$2:$O$102,MATCH(L11,'WPI All Years'!$A$2:$A$102,0),MATCH(L$17,'WPI All Years'!$A$1:$O$1,0)))),\"\")","v":""},null,{"$f":"IF(AND(ISNUMBER(N$8),ISNUMBER(N$11)),IF(AND(N$8>=42005,N$8<=42185),VLOOKUP(N$11,'WPI All Years'!$A$2:$I$102,9,FALSE),IF(AND(N$8>=42186,N$8<=42369),VLOOKUP(N$11,'WPI All Years'!$A$2:$J$102,10,FALSE),INDEX('WPI All Years'!$A$2:$O$102,MATCH(N11,'WPI All Years'!$A$2:$A$102,0),MATCH(N$17,'WPI All Years'!$A$1:$O$1,0)))),\"\")","v":""}]
[null,"Total amount of previous payments refer S58(7)",null,{"$f":"IF(SUM(D$12:D$16)>=0,SUM(D$12:D$16),\"Invalid Previous Payment\")","v":0},null,{"$f":"IF(SUM(F$12:F$16)>=0,SUM(F$12:F$16),\"Invalid Previous Payment\")","v":0},null,{"$f":"IF(SUM(H$12:H$16)>=0,SUM(H$12:H$16),\"Invalid Previous Payment\")","v":0},null,{"$f":"IF(SUM(J$12:J$16)>=0,SUM(J$12:J$16),\"Invalid Previous Payment\")","v":0},null,{"$f":"IF(SUM(L$12:L$16)>=0,SUM(L$12:L$16),\"Invalid Previous Payment\")","v":0},null,{"$f":"IF(SUM(N$12:N$16)>=0,SUM(N$12:N$16),\"Invalid Previous Payment\")","v":0}]
[null,"Amount of compensation payable per claim",null,{"$f":"IF(AND(ISNUMBER(D$11),ISNUMBER(D$18)),IF(D$11<5,0,MAX(D$19-D$20,0)),\"\")","v":""},null,{"$f":"IF(AND(ISNUMBER(F$11),ISNUMBER(F$18)),IF(F$11<5,0,MAX(F$19-F$20,0)),\"\")","v":""},null,{"$f":"IF(AND(ISNUMBER(H$11),ISNUMBER(H$18)),IF(H$11<5,0,MAX(H$19-H$20,0)),\"\")","v":""},null,{"$f":"IF(AND(ISNUMBER(J$11),ISNUMBER(J$18)),IF(J$11<5,0,MAX(J$19-J$20,0)),\"\")","v":""},null,{"$f":"IF(AND(ISNUMBER(L$11),ISNUMBER(L$18)),IF(L$11<5,0,MAX(L$19-L$20,0)),\"\")","v":""},null,{"$f":"IF(AND(ISNUMBER(N$11),ISNUMBER(N$18)),IF(N$11<5,0,MAX(N$19-N$20,0)),\"\")","v":""}]
[]
[null,"Total amount of compensation payable under S58 (sum of injury one to six) across all claims",null,{"$f":"SUM(D21,F21,H21,J21,L21,N21)","v":0},null,{"$f":"IF(SUM(D11,F11,H11,J11,L11,N11)>100,\"The cumulative % WPI for this worker exceeds 100%\",IF('Check Errors'!B9>0,\"The worker has same injury dates for different injuries\",\"\"))","v":""}]
[]
["DISCLAIMER"]
["This calculator and the information and formulas used in it (Calculator) have been developed by ReturnToWorkSA for its own internal use only. In consideration for ReturnToWorkSA"]
[" making the Calculator available to you, you acknowledge that:"]
[" • ReturnToWorkSA does not give any warranties or representations in relation to the accuracy, reliability or completeness of the Calculator;"]
[" • You use the Calculator and any results produced by the Calculator at your own risk;"]
[" • You must make your own independent assessment of the accuracy, reliability and completeness of the Calculator and any results produced by the Calculator; and"]
[" • To the maximum extent permitted by law none of ReturnToWorkSA, its officers, employees, agents or advisers accepts any liability for any loss whatsoever "]
[" (including without limitation any liability arising from any fault or negligence on their part) arising from the use of the Calculator or any results produced by the Calculator"]
[" or otherwise arising in connection with the Calculator."]
[]
[]
[]
[]
[]
[]
[" "]

{"sheet":"Scale of Entitlements (RTW Act)","index":2,"n_rows":112,"n_cols":4,"rows_kept":112,"cut":false,"hidden":false,"merged":[[4,1,4,9],[6,1,6,9],[8,1,8,9],[7,1,7,9]]}
[]
[null,"Scale of Entitlements"]
[]
[null,"Disclaimer:"]
[null,"The S58 lump sum calculator is based on the table below that sets out the percentage of the prescribed sum for each degree of Whole Person Impairment.  Please note that:\n\n● After the percentage is applied to the prescribed sum, the lump sum figure is rounded up to the nearest dollar - in accordance with the Return to Work Act 2014 (the Act) and the Return to Work Regulations 2015 (the Regulations). \n● This figure may be further adjusted to ensure that the compensation amount is not below the minimum as required by the Act. "]
[null,"Please note:"]
[null,"● These conditions may result in the lump sum figure that you calculate using the table provided being slightly different to the official lump sum /  dollar figures listed in Schedule 1 - Scale of entitlements of the Regulations. "]
[null,{"$f":"\"● The table applies only in respect of the prescribed sum \"&C11&\". \"","v":"● The table applies only in respect of the prescribed sum from 01/01/2018 to 31/12/2018. "}]
[null,"● This data is for information only, and the lump sum figures prescribed in Schedule 1 - Scale of entitlements of the Regulations are the actual entitlement."]
[]
[null,"WPI degree","from 01/01/2018 to 31/12/2018",{"$f":"\"% of prescribed sum \"&C11","v":"% of prescribed sum from 01/01/2018 to 31/12/2018"}]
[null,0,0,{"$f":"ROUND(C12/$C$112,3)","v":0}]
[null,1,0,{"$f":"ROUND(C13/$C$112,3)","v":0}]
[null,2,0,0]
[null,3,0,0]
[null,4,0,0]
[null,5,12564,2.5000000000000001E-2]
[null,6,14351,2.9000000000000001E-2]
[null,7,16173,3.2000000000000001E-2]
[null,8,18089,3.5999999999999997E-2]
[null,9,20101,0.04]
[null,10,22111,4.3999999999999997E-2]
[null,11,24114,4.8000000000000001E-2]
[null,12,26297,5.1999999999999998E-2]
[null,13,28643,5.7000000000000002E-2]
[null,14,31155,6.2E-2]
[null,15,33668,6.7000000000000004E-2]
[null,16,36304,7.1999999999999995E-2]
[null,17,39196,7.8E-2]
[null,18,42211,8.4000000000000005E-2]
[null,19,45406,0.09]
[null,20,48888,9.7000000000000003E-2]
[null,21,53964,0.107]
[null,22,59950,0.11899999999999999]
[null,23,66199,0.13200000000000001]
[null,24,72708,0.14499999999999999]
[null,25,80066,0.159]
[null,26,87717,0.17499999999999999]
[null,27,96281,0.192]
[null,28,105172,0.20899999999999999]
[null,29,114392,0.22800000000000001]
[null,30,125272,0.249]
[null,31,135861,0.27]
[null,32,147511,0.29399999999999998]
[null,33,160268,0.31900000000000001]
[null,34,173453,0.34499999999999997]
[null,35,187063,0.372]
[null,36,201864,0.40200000000000002]
[null,37,217904,0.434]
[null,38,234436,0.46700000000000003]
[null,39,252274,0.502]
[null,40,270636,0.53900000000000003]
[null,41,289522,0.57599999999999996]
[null,42,309794,0.61699999999999999]
[null,43,331504,0.66]
[null,44,353803,0.70399999999999996]
[null,45,377604,0.751]
[null,46,402027,0.8]
[null,47,427073,0.85]
[null,48,453704,0.90300000000000002]
[null,49,481967,0.95899999999999996]
[null,50,502497,1]
[null,51,502497,1]
[null,52,502497,1]
[null,53,502497,1]
[null,54,502497,1]
[null,55,502497,1]
[null,56,502497,1]
[null,57,502497,1]
[null,58,502497,1]
[null,59,502497,1]
[null,60,502497,1]
[null,61,502497,1]
[null,62,502497,1]
[null,63,502497,1]
[null,64,502497,1]
[null,65,502497,{"$f":"ROUND(C77/$C$112,3)","v":1}]
[null,66,502497,1]
[null,67,502497,1]
[null,68,502497,1]
[null,69,502497,1]
[null,70,502497,1]
[null,71,502497,1]
[null,72,502497,1]
[null,73,502497,1]
[null,74,502497,1]
[null,75,502497,1]
[null,76,502497,1]
[null,77,502497,1]
[null,78,502497,1]
[null,79,502497,1]
[null,80,502497,1]
[null,81,502497,1]
[null,82,502497,1]
[null,83,502497,1]
[null,84,502497,1]
[null,85,502497,1]
[null,86,502497,1]
[null,87,502497,1]
[null,88,502497,1]
[null,89,502497,1]
[null,90,502497,1]
[null,91,502497,1]
[null,92,502497,1]
[null,93,502497,1]
[null,94,502497,1]
[null,95,502497,1]
[null,96,502497,1]
[null,97,502497,1]
[null,98,502497,1]
[null,99,502497,1]
[null,100,502497,1]

{"sheet":"Version Control","index":3,"n_rows":13,"n_cols":5,"rows_kept":13,"cut":false,"hidden":true,"merged":[]}
[]
[null,"Version Control"]
[]
[null,"Version","Date Updated","Comments","Author"]
[null,12.1,"2012-01-09",null,"Ivan Lebedev"]
[null,12.2,"2012-07-01","Modification to text only in calculator for 1 July 2012 legislative changes, ie, changes resulting from change from compensable 'disability' to compensable 'injury'.","Maureen Barrett"]
[null,13.1,"2013-01-01","Changed method of calculating yearly amounts for consistency. Now use published amounts rather than calculated from 2008 base figures * annual CPI rate within the spreadsheet.","Steve Hammond"]
[null,14.1,"2014-01-07","Added calculated 2014 amounts to 'WPI All Years', 'Schedule 3A All Years', 'Scale of Entitlements' pages.","Maureen Barrett"]
[null,15.1,"2015-01-09","Added calculated 2015 amounts to 'WPI All Years', 'Schedule 3A All Years', 'Scale of Entitlements' pages.","Maureen Barrett"]
[null,16.100000000000001,"2015-04-08","Calculator updated for changes wef 01/07/2015 & new password added to be consistent across all sheets, workbooks and other calculators","Steve Hammond"]
[null,17.100000000000001,"2016-01-01","Added calculated 2016 amounts to 'WPI All Years' and 'Scale of Entitlements' pages.","Steve Hammond"]
[null,18.100000000000001,"2017-01-01","Added calculated 2017 amounts to 'WPI All Years' and 'Scale of Entitlements' pages.","Steve Hammond"]
[null,19.100000000000001,"2018-01-02","Added calculated 2018 amounts to 'WPI All Years' and 'Scale of Entitlements' pages.","Steve Hammond"]

{"sheet":"Check Errors","index":4,"n_rows":9,"n_cols":7,"rows_kept":9,"cut":false,"hidden":true,"merged":[]}
["Check Date",{"$f":"Calculator!D8","v":"00:00:00"},{"$f":"Calculator!F8","v":"00:00:00"},{"$f":"Calculator!H8","v":"00:00:00"},{"$f":"Calculator!J8","v":"00:00:00"},{"$f":"Calculator!L8","v":"00:00:00"},{"$f":"Calculator!N8","v":"00:00:00"}]
[{"$f":"Calculator!D8","v":"00:00:00"},null,{"$f":"IF(AND(C$1=$A2,OR(C$1>0,$A2>0)),1,0)","v":0},0,0,0,0]
[{"$f":"Calculator!F8","v":"00:00:00"},{"$f":"IF(AND(B$1=$A3,OR(B$1>0,$A3>0)),1,0)","v":0},null,0,0,0,0]
[{"$f":"Calculator!H8","v":"00:00:00"},{"$f":"IF(AND(B$1=$A4,OR(B$1>0,$A4>0)),1,0)","v":0},0,null,0,0,0]
[{"$f":"Calculator!J8","v":"00:00:00"},{"$f":"IF(AND(B$1=$A5,OR(B$1>0,$A5>0)),1,0)","v":0},0,0,null,0,0]
[{"$f":"Calculator!L8","v":"00:00:00"},{"$f":"IF(AND(B$1=$A6,OR(B$1>0,$A6>0)),1,0)","v":0},0,0,0,null,0]
[{"$f":"Calculator!N8","v":"00:00:00"},{"$f":"IF(AND(B$1=$A7,OR(B$1>0,$A7>0)),1,0)","v":0},0,0,0,0]
[]
["Checker",{"$f":"SUM(B2:G7)","v":0}]

{"sheet":"WPI All Years","index":5,"n_rows":102,"n_cols":15,"rows_kept":102,"cut":false,"hidden":true,"merged":[]}
["WPI degree",2008,2009,2010,2011,2012,2013,2014,"2015 (old)","2015 (new)",2016,2017,2018,2019,2020]
[0,0,0,0,0,0,0,0,0,0,0,0,0]
[1,0,0,0,0,0,0,0,0,0,0,0,0]
[2,0,0,0,0,0,0,0,0,0,0,0,0]
[3,0,0,0,0,0,0,0,0,0,0,0,0]
[4,0,0,0,0,0,0,0,0,0,0,0,0]
[5,10000,10514,10657,10936,11370,11567,11795,12045,12051,12188,12336,12564]
[6,11424,12012,12175,12494,12989,13215,13475,13761,13766,13922,14091,14351]
[7,12874,13536,13720,14079,14637,14892,15185,15507,15513,15689,15880,16173]
[8,14363,15102,15307,15708,16330,16614,16941,17301,17351,17548,17761,18089]
[9,15902,16720,16947,17391,18080,18394,18756,19154,19281,19500,19737,20101]
[10,17500,18400,18650,19138,19897,20243,20641,21079,21209,21450,21710,22111]
[11,19168,20154,20427,20962,21792,22172,22608,23087,23131,23394,23678,24114]
[12,20916,21991,22289,22872,23779,24193,24668,25192,25225,25511,25821,26297]
[13,22753,23923,24248,24883,25869,26319,26836,27406,27475,27787,28124,28643]
[14,24689,25958,26310,26998,28069,28557,29118,29736,29885,30224,30591,31155]
[15,26731,28105,28486,29231,30390,30919,31527,32195,32295,32661,33058,33668]
[16,28889,30374,30786,31591,32844,33415,34072,34795,34824,35219,35647,36304]
[17,31170,32772,33216,34085,35436,36052,36761,37541,37598,38025,38486,39196]
[18,33582,35308,35787,36723,38179,38843,39607,40447,40490,40949,41446,42211]
[19,36132,37990,38505,39512,41078,41793,42615,43519,43555,44049,44584,45406]
[20,38827,40823,41376,42458,44141,44909,45792,46764,46895,47427,48003,48888]
[21,41673,43815,44409,45571,47377,48201,49149,50192,51764,52351,52987,53964]
[22,44676,46973,47610,48855,50792,51675,52692,53809,57506,58158,58864,59950]
[23,47842,50301,50983,52317,54390,55336,56425,57622,63500,64220,65000,66199]
[24,51176,53807,54536,55962,58181,59193,60357,61637,69744,70535,71391,72708]
[25,54683,57494,58273,59797,62167,63249,64493,65861,76802,77673,78616,80066]
[26,58368,61368,62200,63827,66357,67511,68839,70299,84141,85095,86128,87717]
[27,62236,65435,66322,68057,70754,71985,73401,74958,92356,93403,94537,96281]
[28,66288,69695,70640,72488,75361,76672,78179,79838,100885,102029,103267,105172]
[29,70531,74156,75161,77127,80184,81579,83183,84948,109729,110973,112320,114392]
[30,75000,78855,79924,82014,85265,86748,88454,90331,120165,121527,123002,125272]
[31,79594,83685,84819,87037,90487,92061,93872,95863,130323,131800,133400,135861]
[32,84421,88760,89963,92316,95975,97644,99565,101677,141498,143102,144839,147511]
[33,89446,94044,95318,97811,101688,103457,105491,107729,153735,155478,157365,160268]
[34,94673,99539,100888,103526,107630,109502,111656,114024,166382,168268,170310,173453]
[35,100101,105246,106672,109462,113800,115780,118057,120561,179438,181472,183675,187063]
[36,105732,111167,112673,115620,120202,122293,124698,127344,193635,195830,198207,201864]
[37,111566,117300,118889,121998,126834,129040,131578,134369,209022,211391,213957,217904]
[38,117604,123649,125324,128601,133699,136025,138700,141642,224880,227429,230189,234436]
[39,123845,130211,131975,135426,140794,143243,146060,149159,241991,244734,247704,252274]
[40,130288,136985,138841,142472,148119,150696,153659,156919,259604,262546,265733,270636]
[41,136932,143970,145921,149737,155672,158380,161495,164921,277720,280867,284277,289522]
[42,143775,151165,153213,157220,163451,166295,169565,173162,297166,300534,304182,309794]
[43,150817,158569,160717,164920,171457,174439,177870,181643,317991,321595,325498,331504]
[44,158055,166179,168430,172835,179685,182811,186406,190361,339381,343227,347393,353803]
[45,165486,173992,176349,180961,188133,191406,195170,199311,362212,366317,370763,377604]
[46,173107,182004,184470,189294,196797,200220,204158,208489,385640,390010,394744,402027]
[47,180916,190215,192792,197834,205675,209253,213368,217895,409665,414308,419337,427073]
[48,188907,198616,201307,206571,214759,218495,222792,227518,435210,440142,445485,453704]
[49,197078,207207,210014,215506,224048,227945,232428,237359,462321,467560,473236,481967]
[50,205424,215982,218908,224632,233536,237599,242271,247411,482014,487476,493393,502497]
[51,213940,224936,227983,233945,243218,247448,252315,257668,482014,487476,493393,502497]
[52,222621,234063,237234,243438,253087,257489,262553,268123,482014,487476,493393,502497]
[53,231461,243357,246654,253104,263136,267714,272978,278770,482014,487476,493393,502497]
[54,240455,252814,256239,262940,273362,278117,283586,289603,482014,487476,493393,502497]
[55,250000,262849,266410,273376,284212,289156,294843,301098,482014,487476,493393,502497]
[56,258877,272182,275869,283083,294304,299423,305311,311788,482014,487476,493393,502497]
[57,268292,282081,285902,293378,305007,310312,316415,323128,482014,487476,493393,502497]
[58,277832,292112,296069,303811,315853,321348,327667,334619,482014,487476,493393,502497]
[59,287491,302267,306362,314373,326834,332519,339059,346252,482014,487476,493393,502497]
[60,297260,312538,316772,325055,337940,343818,350580,358017,482014,487476,493393,502497]
[61,307131,322916,327291,335849,349162,355235,362221,369906,482014,487476,493393,502497]
[62,317094,333392,337908,346744,360488,366759,373971,381905,482014,487476,493393,502497]
[63,327140,343954,348613,357729,371908,378378,385819,394004,482014,487476,493393,502497]
[64,337260,354594,359398,368796,383414,390083,397755,406193,482014,487476,493393,502497]
[65,347444,365301,370250,379932,394991,401862,409765,418458,482014,487476,493393,502497]
[66,357680,376063,381157,391124,406627,413700,421836,430785,482014,487476,493393,502497]
[67,367959,386871,392112,402365,418314,425591,433960,443167,482014,487476,493393,502497]
[68,378270,397712,403100,413641,430036,437517,446121,455585,482014,487476,493393,502497]
[69,388600,408573,414108,424936,441780,449465,458304,468027,482014,487476,493393,502497]
[70,400000,420558,426255,437401,454739,462649,471747,481755,482014,487476,493393,502497]
[71,400000,420558,426255,437401,454739,462649,471747,481755,482014,487476,493393,502497]
[72,400000,420558,426255,437401,454739,462649,471747,481755,482014,487476,493393,502497]
[73,400000,420558,426255,437401,454739,462649,471747,481755,482014,487476,493393,502497]
[74,400000,420558,426255,437401,454739,462649,471747,481755,482014,487476,493393,502497]
[75,400000,420558,426255,437401,454739,462649,471747,481755,482014,487476,493393,502497]
[76,400000,420558,426255,437401,454739,462649,471747,481755,482014,487476,493393,502497]
[77,400000,420558,426255,437401,454739,462649,471747,481755,482014,487476,493393,502497]
[78,400000,420558,426255,437401,454739,462649,471747,481755,482014,487476,493393,502497]
[79,400000,420558,426255,437401,454739,462649,471747,481755,482014,487476,493393,502497]
[80,400000,420558,426255,437401,454739,462649,471747,481755,482014,487476,493393,502497]
[81,400000,420558,426255,437401,454739,462649,471747,481755,482014,487476,493393,502497]
[82,400000,420558,426255,437401,454739,462649,471747,481755,482014,487476,493393,502497]
[83,400000,420558,426255,437401,454739,462649,471747,481755,482014,487476,493393,502497]
[84,400000,420558,426255,437401,454739,462649,471747,481755,482014,487476,493393,502497]
[85,400000,420558,426255,437401,454739,462649,471747,481755,482014,487476,493393,502497]
[86,400000,420558,426255,437401,454739,462649,471747,481755,482014,487476,493393,502497]
[87,400000,420558,426255,437401,454739,462649,471747,481755,482014,487476,493393,502497]
[88,400000,420558,426255,437401,454739,462649,471747,481755,482014,487476,493393,502497]
[89,400000,420558,426255,437401,454739,462649,471747,481755,482014,487476,493393,502497]
[90,400000,420558,426255,437401,454739,462649,471747,481755,482014,487476,493393,502497]
[91,400000,420558,426255,437401,454739,462649,471747,481755,482014,487476,493393,502497]
[92,400000,420558,426255,437401,454739,462649,471747,481755,482014,487476,493393,502497]
[93,400000,420558,426255,437401,454739,462649,471747,481755,482014,487476,493393,502497]
[94,400000,420558,426255,437401,454739,462649,471747,481755,482014,487476,493393,502497]
[95,400000,420558,426255,437401,454739,462649,471747,481755,482014,487476,493393,502497]
[96,400000,420558,426255,437401,454739,462649,471747,481755,482014,487476,493393,502497]
[97,400000,420558,426255,437401,454739,462649,471747,481755,482014,487476,493393,502497]
[98,400000,420558,426255,437401,454739,462649,471747,481755,482014,487476,493393,502497]
[99,400000,420558,426255,437401,454739,462649,471747,481755,482014,487476,493393,502497]
[100,400000,420558,426255,437401,454739,462649,471747,481755,482014,487476,493393,502497]